Uploaded image for project: 'HBase'
  1. HBase
  2. HBASE-19490

Rare failure in TestRateLimiter

    XMLWordPrintableJSON

    Details

    • Hadoop Flags:
      Reviewed

      Description

      Maybe we aren't waiting long enough for a slow executor? Or it is some kind of race. Test usually passes.

      [ERROR] Tests run: 15, Failures: 1, Errors: 0, Skipped: 0, Time elapsed: 1.01 s <<< FAILURE! - in org.apache.hadoop.hbase.quotas.TestRateLimiter
      [ERROR] testOverconsumptionFixedIntervalRefillStrategy(org.apache.hadoop.hbase.quotas.TestRateLimiter) Time elapsed: 0.028 s <<< FAILURE!
      java.lang.AssertionError: expected:<1000> but was:<999>
      at org.apache.hadoop.hbase.quotas.TestRateLimiter.testOverconsumptionFixedIntervalRefillStrategy(TestRateLimiter.java:122)

        Attachments

        1. HBASE-19490.v0.patch
          2 kB
          Chia-Ping Tsai
        2. HBASE-19490.branch-1.v0.patch
          2 kB
          Chia-Ping Tsai

          Activity

            People

            • Assignee:
              chia7712 Chia-Ping Tsai
              Reporter:
              apurtell Andrew Kyle Purtell
            • Votes:
              0 Vote for this issue
              Watchers:
              4 Start watching this issue

              Dates

              • Created:
                Updated:
                Resolved: